欢迎光临
我的个人博客网站

vue使用webpack打包失败


vue打包报错

ERROR in static/js/vendor.0bab1cca7597d53f5cb2.js from UglifyJs Unexpected token: punc (() [./~/_vue-fancybox@1.0.3@vue-fancybox/src/fancyBox.js:7,0][static/js/vendor.0bab1cca7597d53f5cb2.js:172930,11]    Build failed with errors.  npm ERR! code ELIFECYCLE npm ERR! errno 1 npm ERR! system@1.0.0 build: `node build/build.js` npm ERR! Exit status 1 npm ERR!  npm ERR! Failed at the system@1.0.0 build script. npm ERR! This is probably not a problem with npm. There is likely additional logging output above.  npm ERR! A complete log of this run can be found in: npm ERR!     /Users/eternity/.npm/_logs/2020-12-04T01_13_17_386Z-debug.log The terminal process "/bin/zsh '-c', 'npm run build'" terminated with exit code: 1. 

解决

修改build文件夹下的webpack.base.conf.js。

原来的文件

... { 		test: /.js$/, 		loader: 'babel-loader', 		include: [resolve('src'), resolve('test'), resolve('/node_modules/vue-fancybox/src'), 			resolve('/node_modules/.1.0.3@vue-fancybox/src') 		] },       ... 

修改之后的文件

... { 		test: /.js$/, 		loader: 'babel-loader', 		include: [resolve('src'), resolve('test'), resolve('/node_modules/vue-fancybox/src'), 			resolve('/node_modules/.1.0.3@vue-fancybox/src'), 			resolve('/node_modules/_vue-fancybox@1.0.3@vue-fancybox/src/fancyBox.js') 		] },       ... 
赞(0) 打赏
未经允许不得转载:张拓的天空 » vue使用webpack打包失败
分享到: 更多 (0)

评论 抢沙发

  • 昵称 (必填)
  • 邮箱 (必填)
  • 网址

专业的IT技术经验分享 更专业 更方便

联系我们本站主机

觉得文章有用就打赏一下文章作者

支付宝扫一扫打赏

微信扫一扫打赏